BDBM50265989 CHEMBL462707::N-(3-(4-methylpiperazin-1-yl)-7-(trifluoromethyl)quinoxalin-5-yl)-3-nitrobenzenesulfonamide
SMILES CN1CCN(CC1)c1cnc2cc(cc(NS(=O)(=O)c3cccc(c3)[N+]([O-])=O)c2n1)C(F)(F)F
InChI Key InChIKey=LCRYDJIBUIVTFD-UHFFFAOYSA-N
Data  2 IC50
  Tab Delimited (TSV)   2D SDfile   Computed 3D by Vconf -m prep SDfile
Find this compound or compounds like it in BindingDB:
Activity Spreadsheet -- Enzyme Inhibition Constant Data from BindingDB
Found 2 hits for monomerid = 50265989
TargetHepatocyte growth factor receptor(Homo sapiens (Human))
Sichuan University
Curated by ChEMBL
LigandPNGBDBM50265989(CHEMBL462707 | N-(3-(4-methylpiperazin-1-yl)-7-(tr...)
Affinity DataIC50:  17nM. Assay description: Inhibition of human c-MET
In DepthDetails ArticlePubMed
TargetHepatocyte growth factor receptor(Homo sapiens (Human))
Sichuan University
Curated by ChEMBL
LigandPNGBDBM50265989(CHEMBL462707 | N-(3-(4-methylpiperazin-1-yl)-7-(tr...)
Affinity DataIC50:  17nM. Assay description: Inhibition of human recombinant his-tagged c-Met by TR-FRET assay
In DepthDetails ArticlePubMed