BDBM50265993 CHEMBL451230::phenyl 4-(4,5-dihydro-1H-imidazol-2-yl)benzoate
SMILES O=C(Oc1ccccc1)c1ccc(cc1)C1=NCCN1
InChI Key InChIKey=KBQKAAWDURESJQ-UHFFFAOYSA-N
Data  2 KI
  Tab Delimited (TSV)   2D SDfile   Computed 3D by Vconf -m prep SDfile
Find this compound or compounds like it in BindingDB:
Activity Spreadsheet -- Enzyme Inhibition Constant Data from BindingDB
Found 2 hits for monomerid = 50265993
TargetAmine oxidase [flavin-containing] B(Rattus norvegicus (rat))
Universidade Federal De Santa Maria
Curated by ChEMBL
LigandPNGBDBM50265993(CHEMBL451230 | phenyl 4-(4,5-dihydro-1H-imidazol-2...)
Affinity DataKi:  1.38E+3nM. Assay description: Binding affinity to MAOB imidazoline binding site in rat brain mitochondrial homogenate assessed as 4-hydroxyquinoline production by spectrophotometr...
In DepthDetails ArticlePubMed
TargetAmine oxidase [flavin-containing] A(Rattus norvegicus (rat))
Universidade Federal De Santa Maria
Curated by ChEMBL
LigandPNGBDBM50265993(CHEMBL451230 | phenyl 4-(4,5-dihydro-1H-imidazol-2...)
Affinity DataKi:  1.28E+4nM. Assay description: Binding affinity to MAOA imidazoline binding site in rat brain mitochondrial homogenate assessed as 4-hydroxyquinoline production by spectrophotometr...
In DepthDetails ArticlePubMed