BDBM50266012 1-(4-methoxyphenyl)-3-(methylsulfonyl)-6-(4-(1-(pyrrolidin-1-ylmethyl)cyclopropyl)phenyl)-3a,4,5,6-tetrahydro-1H-pyrazolo[3,4-c]pyridin-7(7aH)-one 2,2,2-trifluoroacetate::CHEMBL453208
SMILES COc1ccc(cc1)N1N=C(C2CCN(C(=O)C12)c1ccc(cc1)C1(CN2CCCC2)CC1)S(C)(=O)=O
InChI Key InChIKey=DOZKWGKHXPBOML-UHFFFAOYSA-N
Data  1 KI
  Tab Delimited (TSV)   2D SDfile   Computed 3D by Vconf -m prep SDfile
Find this compound or compounds like it in BindingDB:
Activity Spreadsheet -- Enzyme Inhibition Constant Data from BindingDB
Found 1 hit for monomerid = 50266012
TargetCoagulation factor X(Homo sapiens (Human))
Bristol-Myers Squibb
Curated by ChEMBL
LigandPNGBDBM50266012(1-(4-methoxyphenyl)-3-(methylsulfonyl)-6-(4-(1-(py...)
Affinity DataKi:  0.0500nM. Assay description: Binding affinity to human coagulation factor 10a
In DepthDetails ArticlePubMed