BDBM50266081 1-(4-methoxyphenyl)-3-(methylsulfonyl)-6-(4-(1-((2-oxopyrrolidin-1-yl)methyl)cyclopropyl)phenyl)-5,6-dihydro-1H-pyrazolo[3,4-c]pyridin-7(4H)-one::CHEMBL456034
SMILES COc1ccc(cc1)-n1nc(c2CCN(C(=O)c12)c1ccc(cc1)C1(CN2CCCC2=O)CC1)S(C)(=O)=O
InChI Key InChIKey=LETIREDJFXZCNR-UHFFFAOYSA-N
Data  1 KI
  Tab Delimited (TSV)   2D SDfile   Computed 3D by Vconf -m prep SDfile
Find this compound or compounds like it in BindingDB:
Activity Spreadsheet -- Enzyme Inhibition Constant Data from BindingDB
Found 1 hit for monomerid = 50266081
TargetCoagulation factor X(Homo sapiens (Human))
Bristol-Myers Squibb
Curated by ChEMBL
LigandPNGBDBM50266081(1-(4-methoxyphenyl)-3-(methylsulfonyl)-6-(4-(1-((2...)
Affinity DataKi:  0.240nM. Assay description: Binding affinity to human coagulation factor 10a
In DepthDetails ArticlePubMed