BDBM50266291 6-chloro-2-(4-methylpiperazin-1-yl)-8-phenylquinoxaline::CHEMBL458217
SMILES CN1CCN(CC1)c1cnc2cc(Cl)cc(-c3ccccc3)c2n1
InChI Key InChIKey=DGHFAJBYVDNLOO-UHFFFAOYSA-N
Data  2 IC50
  Tab Delimited (TSV)   2D SDfile   Computed 3D by Vconf -m prep SDfile
Find this compound or compounds like it in BindingDB:
Activity Spreadsheet -- Enzyme Inhibition Constant Data from BindingDB
Found 2 hits for monomerid = 50266291
TargetHepatocyte growth factor receptor(Homo sapiens (Human))
Sichuan University
Curated by ChEMBL
LigandPNGBDBM50266291(6-chloro-2-(4-methylpiperazin-1-yl)-8-phenylquinox...)
Affinity DataIC50:  2.80E+3nM. Assay description: Inhibition of human c-MET
In DepthDetails ArticlePubMed
TargetHepatocyte growth factor receptor(Homo sapiens (Human))
Sichuan University
Curated by ChEMBL
LigandPNGBDBM50266291(6-chloro-2-(4-methylpiperazin-1-yl)-8-phenylquinox...)
Affinity DataIC50:  2.80E+3nM. Assay description: Inhibition of human recombinant his-tagged c-Met by TR-FRET assay
In DepthDetails ArticlePubMed