BDBM50266318 6-(4-(1-(1H-imidazol-2-yl)cyclopropyl)phenyl)-1-(4-methoxyphenyl)-3-(trifluoromethyl)-5,6-dihydro-1H-pyrazolo[3,4-c]pyridin-7(4H)-one::CHEMBL515066
SMILES COc1ccc(cc1)-n1nc(c2CCN(C(=O)c12)c1ccc(cc1)C1(CC1)c1ncc[nH]1)C(F)(F)F
InChI Key InChIKey=UOQDNQKPHRFEMD-UHFFFAOYSA-N
Data  1 KI
  Tab Delimited (TSV)   2D SDfile   Computed 3D by Vconf -m prep SDfile
Find this compound or compounds like it in BindingDB:
Activity Spreadsheet -- Enzyme Inhibition Constant Data from BindingDB
Found 1 hit for monomerid = 50266318
TargetCoagulation factor X(Homo sapiens (Human))
Bristol-Myers Squibb
Curated by ChEMBL
LigandPNGBDBM50266318(6-(4-(1-(1H-imidazol-2-yl)cyclopropyl)phenyl)-1-(4...)
Affinity DataKi:  1.10nM. Assay description: Binding affinity to human coagulation factor 10a
In DepthDetails ArticlePubMed