BDBM50266334 2-(2-acetyl-5-tert-butylthiophen-3-ylcarbamoyl)benzoate
SMILES CC(=O)c1sc(cc1NC(=O)c1ccccc1C([O-])=O)C(C)(C)C
InChI Key InChIKey=FQRPHLJLYPTTQW-UHFFFAOYSA-M
Data  1 IC50
  Tab Delimited (TSV)   2D SDfile   Computed 3D by Vconf -m prep SDfile
Find this compound or compounds like it in BindingDB:
Activity Spreadsheet -- Enzyme Inhibition Constant Data from BindingDB
Found 1 hit for monomerid = 50266334
TargetTrans-sialidase(Trypanosoma cruzi)
University Of Manchester
Curated by ChEMBL
LigandPNGBDBM50266334(2-(2-acetyl-5-tert-butylthiophen-3-ylcarbamoyl)ben...)
Affinity DataIC50:  2.70E+5nM. Assay description: Inhibition of Trypanosoma cruzi trans-Sialidase by MuNANA assay
In DepthDetails ArticlePubMed