BDBM50266453 CHEMBL513933::N-(2-{5-Methoxy-2-[(6-nitro-2,3-dihydro-1H-indol-1yl)methyl)]-1H-indole-3-yl}ethyl) acetamide
SMILES COc1ccc2[nH]c(CN3CCc4ccc(cc34)[N+]([O-])=O)c(CCNC(C)=O)c2c1
InChI Key InChIKey=IDSDEOVVGPJJEU-UHFFFAOYSA-N
Data  2 KI
  Tab Delimited (TSV)   2D SDfile   Computed 3D by Vconf -m prep SDfile
Find this compound or compounds like it in BindingDB:
Activity Spreadsheet -- Enzyme Inhibition Constant Data from BindingDB
Found 2 hits for monomerid = 50266453
TargetMelatonin receptor type 1B(Homo sapiens (Human))
University Of WüRzburg
Curated by ChEMBL
LigandPNGBDBM50266453(CHEMBL513933 | N-(2-{5-Methoxy-2-[(6-nitro-2,3-dih...)
Affinity DataKi:  26nM. Assay description: Displacement of 2-[125I]Iodomelatonin from human MT2 receptor expressed in CHO cells
In DepthDetails ArticlePubMed
TargetMelatonin receptor type 1A(Homo sapiens (Human))
University Of WüRzburg
Curated by ChEMBL
LigandPNGBDBM50266453(CHEMBL513933 | N-(2-{5-Methoxy-2-[(6-nitro-2,3-dih...)
Affinity DataKi:  309nM. Assay description: Displacement of 2-[125I]Iodomelatonin from human MT1 receptor expressed in CHO cells
In DepthDetails ArticlePubMed