BDBM50266554 CHEMBL457569::N-(1-benzylidene-3-(2-(dimethylamino)ethyl)-2-methyl-1H-inden-5-yl)naphthalene-2-sulfonamide
SMILES CN(C)CCC1=C(C)\C(=C\c2ccccc2)c2ccc(NS(=O)(=O)c3ccc4ccccc4c3)cc12
InChI Key InChIKey=KRAFDWDSBDERGJ-FSGOGVSDSA-N
Data  1 KI
  Tab Delimited (TSV)   2D SDfile   Computed 3D by Vconf -m prep SDfile
Find this compound or compounds like it in BindingDB:
Activity Spreadsheet -- Enzyme Inhibition Constant Data from BindingDB
Found 1 hit for monomerid = 50266554
Target5-hydroxytryptamine receptor 6(Homo sapiens (Human))
Universitat De Barcelona
Curated by ChEMBL
LigandPNGBDBM50266554(CHEMBL457569 | N-(1-benzylidene-3-(2-(dimethylamin...)
Affinity DataKi:  216nM. Assay description: Displacement of [3H]LSD from human 5HT6 receptor expressed in HEK293 cells by liquid scintillation counting
In DepthDetails ArticlePubMed