BDBM50266799 2-((3-hydroxyphenylimino)methyl)-4-nitrophenol::CHEMBL476165
SMILES Oc1cccc(c1)\N=C\c1cc(ccc1O)[N+]([O-])=O
InChI Key InChIKey=UXUOJZYQLWPXPR-RIYZIHGNSA-N
Data  1 IC50
  Tab Delimited (TSV)   2D SDfile   Computed 3D by Vconf -m prep SDfile
Find this compound or compounds like it in BindingDB:
Activity Spreadsheet -- Enzyme Inhibition Constant Data from BindingDB
Found 1 hit for monomerid = 50266799
TargetNH(3)-dependent NAD(+) synthetase(Bacillus anthracis)
University Of Alabama At Birmingham
Curated by ChEMBL
LigandPNGBDBM50266799(2-((3-hydroxyphenylimino)methyl)-4-nitrophenol | C...)
Affinity DataIC50:  2.25E+4nM. Assay description: Inhibition of Bacillus anthracis NAD synthetase
In DepthDetails ArticlePubMed