BDBM50266808 1-(2,4-Dichlorophenyl)-4-cyano-5-(4-iodophenyl)-N-(piperidin-1-yl)-1H-pyrazole-3-carboxamide::CHEMBL514845
SMILES Clc1ccc(c(Cl)c1)-n1nc(C(=O)NN2CCCCC2)c(C#N)c1-c1ccc(I)cc1
InChI Key InChIKey=QHZDSOXHNCQNOY-UHFFFAOYSA-N
Data  1 KI
  Tab Delimited (TSV)   2D SDfile   Computed 3D by Vconf -m prep SDfile
Find this compound or compounds like it in BindingDB:
Activity Spreadsheet -- Enzyme Inhibition Constant Data from BindingDB
Found 1 hit for monomerid = 50266808
TargetCannabinoid receptor 1(Homo sapiens (Human))
Johns Hopkins University School Of Medicine
Curated by ChEMBL
LigandPNGBDBM50266808(1-(2,4-Dichlorophenyl)-4-cyano-5-(4-iodophenyl)-N-...)
Affinity DataKi:  33nM. Assay description: Displacement of [3H]CP55940 form human recombinant CB1 receptor expressed in HEK293 cells by liquid scintillation counting
In DepthDetails ArticlePubMed