BDBM50267362 (2'S,8R,9S,13S,14S)-3-hydroxy-13-methyl-4',5',6,7,8,9,11,12,13,14,15,16-dodecahydrospiro[cyclopenta[a]phenanthrene-17,2'-pyran]-6'(3'H)-one::CHEMBL515655
SMILES C[C@]12CC[C@H]3[C@@H](CCc4cc(O)ccc34)[C@@H]1CC[C@@]21CCCC(=O)O1
InChI Key InChIKey=JKDAAJLXLBIPGC-DGYCAGFBSA-N
Data  2 IC50
  Tab Delimited (TSV)   2D SDfile   Computed 3D by Vconf -m prep SDfile
Find this compound or compounds like it in BindingDB:
Activity Spreadsheet -- Enzyme Inhibition Constant Data from BindingDB
Found 2 hits for monomerid = 50267362
Target17-beta-hydroxysteroid dehydrogenase type 2(Homo sapiens (Human))
Saarland University
Curated by ChEMBL
LigandPNGBDBM50267362((2'S,8R,9S,13S,14S)-3-hydroxy-13-methyl-4',5',6,7,...)
Affinity DataIC50:  34nM. Assay description: Inhibition of 17beta-HSD2 (unknown origin)
In DepthDetails ArticlePubMed
TargetAldo-keto reductase family 1 member C3(Homo sapiens (Human))
Chul Research Center And University Laval
Curated by ChEMBL
LigandPNGBDBM50267362((2'S,8R,9S,13S,14S)-3-hydroxy-13-methyl-4',5',6,7,...)
Affinity DataIC50:  20nM. Assay description: Inhibition of human 17beta-HSD5 expressed in HEK293 cells assessed as enzyme-mediated transformation of [14C]-4-androstene-3,17-dione in to [14C]-tes...
In DepthDetails ArticlePubMed