BDBM50267408 6-(4-Fluoro-2-methylbutyl)-4-methylpyridin-2-amine::CHEMBL447472
SMILES CC(CCF)Cc1cc(C)cc(N)n1
InChI Key InChIKey=SSLIYTOKLPEXCV-UHFFFAOYSA-N
Data  1 IC50
  Tab Delimited (TSV)   2D SDfile   Computed 3D by Vconf -m prep SDfile
Find this compound or compounds like it in BindingDB:
Activity Spreadsheet -- Enzyme Inhibition Constant Data from BindingDB
Found 1 hit for monomerid = 50267408
TargetNitric oxide synthase, inducible(Homo sapiens (Human))
Washington University
Curated by ChEMBL
LigandPNGBDBM50267408(6-(4-Fluoro-2-methylbutyl)-4-methylpyridin-2-amine...)
Affinity DataIC50:  731nM. Assay description: Inhibition of human recombinant iNOS using 1 mM NADH and 2 uM L-arginine after 30 mins
In DepthDetails ArticlePubMed