BDBM50267440 4-((S)-2-acetamido-3-((3S,6S)-6-((S)-5-amino-1-((2S,3R)-1-amino-3-hydroxy-1-oxobutan-2-ylamino)-1,5-dioxopentan-2-ylcarbamoyl)-4-oxo-1,2,3,4,6,7-hexahydroazepino[3,2,1-hi]indol-3-ylamino)-3-oxopropyl)phenyl dihydrogen phosphate::CHEMBL503765
SMILES C[C@@H](O)[C@H](NC(=O)[C@H](CCC(N)=O)NC(=O)[C@@H]1Cc2cccc3CC[C@H](NC(=O)[C@H](Cc4ccc(OP(O)(O)=O)cc4)NC(C)=O)C(=O)N1c23)C(N)=O
InChI Key InChIKey=PZLHUTSSXDECRM-KOSFKDODSA-N
Data  1 IC50
  Tab Delimited (TSV)   2D SDfile   Computed 3D by Vconf -m prep SDfile
Find this compound or compounds like it in BindingDB:
Activity Spreadsheet -- Enzyme Inhibition Constant Data from BindingDB
Found 1 hit for monomerid = 50267440
TargetSignal transducer and activator of transcription 3(Homo sapiens (Human))
The University Of Texas M.D. Anderson Cancer Center
Curated by ChEMBL
LigandPNGBDBM50267440(4-((S)-2-acetamido-3-((3S,6S)-6-((S)-5-amino-1-((2...)
Affinity DataIC50:  231nM. Assay description: Inhibition of Stat3 (unknown origin) by fluorescence polarization assay
In DepthDetails ArticlePubMed