BDBM50267474 2-Chloro-N6-cyclopentyl-9H-(2-C-methyl-5-chloro-5-deoxy-beta-D-ribofuranosyl)adenine::CHEMBL478071
SMILES C[C@@]1(O)[C@H](O)[C@@H](CCl)O[C@H]1n1cnc2c(NC3CCCC3)nc(Cl)nc12
InChI Key InChIKey=GHKVAAPTNWFDFP-ROMFRFKVSA-N
Data  4 KI
  Tab Delimited (TSV)   2D SDfile   Computed 3D by Vconf -m prep SDfile
Find this compound or compounds like it in BindingDB:
Activity Spreadsheet -- Enzyme Inhibition Constant Data from BindingDB
Found 4 hits for monomerid = 50267474
TargetAdenosine receptor A1(Homo sapiens (Human))
University Of Camerino
Curated by ChEMBL
LigandPNGBDBM50267474(2-Chloro-N6-cyclopentyl-9H-(2-C-methyl-5-chloro-5-...)
Affinity DataKi:  13nM. Assay description: Displacement of [3H]CCPA from human recombinant adenosine A1 receptor expressed in CHO cells
In DepthDetails ArticlePubMed
TargetAdenosine receptor A3(Homo sapiens (Human))
University Of Camerino
Curated by ChEMBL
LigandPNGBDBM50267474(2-Chloro-N6-cyclopentyl-9H-(2-C-methyl-5-chloro-5-...)
Affinity DataKi:  3.03E+3nM. Assay description: Displacement of [3H]HEMADO from human recombinant adenosine A3 receptor expressed in CHO cells
In DepthDetails ArticlePubMed
TargetAdenosine receptor A2b(Homo sapiens (Human))
University Of Camerino
Curated by ChEMBL
LigandPNGBDBM50267474(2-Chloro-N6-cyclopentyl-9H-(2-C-methyl-5-chloro-5-...)
Affinity DataKi: >1.00E+4nM. Assay description: Agonist activity at human adenosine A2B receptor expressed in CHO cells assessed as inhibition of NECA-stimulated adenylyl cyclase activity
In DepthDetails ArticlePubMed
TargetAdenosine receptor A2a(Homo sapiens (Human))
University Of Camerino
Curated by ChEMBL
LigandPNGBDBM50267474(2-Chloro-N6-cyclopentyl-9H-(2-C-methyl-5-chloro-5-...)
Affinity DataKi:  1.62E+4nM. Assay description: Displacement of [3H]NECA from human recombinant adenosine A2A receptor expressed in CHO cells
In DepthDetails ArticlePubMed