BDBM50267800 3-(6-Hydroxymethylbenzofuran-3-yl)-4-(7-methoxymethyl-1-methyl-1H-indol-3-yl)pyrrole-2,5-dione::CHEMBL490636
SMILES COCc1cccc2c(cn(C)c12)C1=C(C(=O)NC1=O)c1coc2cc(CO)ccc12
InChI Key InChIKey=SYDMGVUQGZKVBH-UHFFFAOYSA-N
Data  1 IC50
  Tab Delimited (TSV)   2D SDfile   Computed 3D by Vconf -m prep SDfile
Find this compound or compounds like it in BindingDB:
Activity Spreadsheet -- Enzyme Inhibition Constant Data from BindingDB
Found 1 hit for monomerid = 50267800
TargetGlycogen synthase kinase-3 beta(Homo sapiens (Human))
University Of Illinois At Chicago
Curated by ChEMBL
LigandPNGBDBM50267800(3-(6-Hydroxymethylbenzofuran-3-yl)-4-(7-methoxymet...)
Affinity DataIC50:  0.730nM. Assay description: Inhibition of human GSK3-beta by scintillation counting
In DepthDetails ArticlePubMed