BDBM50268431 (S)-N-((S)-1-amino-3-(3-tert-butyl-4-hydroxyphenyl)-1-oxopropan-2-yl)-2-((S)-2-amino-3-phenylpropanamido)-N,3-dimethylbutanamide::CHEMBL495994
SMILES CC(C)[C@H](NC(=O)[C@@H](N)Cc1ccccc1)C(=O)N(C)[C@@H](Cc1ccc(O)c(c1)C(C)(C)C)C(N)=O
InChI Key InChIKey=DDYLEAUSYRMSGP-FIXSFTCYSA-N
Data  1 IC50
  Tab Delimited (TSV)   2D SDfile   Computed 3D by Vconf -m prep SDfile
Find this compound or compounds like it in BindingDB:
Activity Spreadsheet -- Enzyme Inhibition Constant Data from BindingDB
Found 1 hit for monomerid = 50268431
TargetMotilin receptor(Oryctolagus cuniculus)
Chugai Pharmaceutical
Curated by ChEMBL
LigandPNGBDBM50268431((S)-N-((S)-1-amino-3-(3-tert-butyl-4-hydroxyphenyl...)
Affinity DataIC50:  24nM. Assay description: Displacement of [125I]motilin from MTL receptor in rabbit duodenum homogenate
In DepthDetails ArticlePubMed