BDBM50268584 Ac-D-pro-L-Phe-D-trp-L-Phe-NH2::CHEMBL450818
SMILES CC(=O)N1CCC[C@@H]1C(=O)N[C@@H](Cc1ccccc1)C(=O)N[C@H](Cc1c[nH]c2ccccc12)C(=O)N[C@@H](Cc1ccccc1)C(N)=O
InChI Key InChIKey=WEBVKDVBAOYUMD-GASGPIRDSA-N
Data  3 KI
  Tab Delimited (TSV)   2D SDfile   Computed 3D by Vconf -m prep SDfile
Find this compound or compounds like it in BindingDB:
Activity Spreadsheet -- Enzyme Inhibition Constant Data from BindingDB
Found 3 hits for monomerid = 50268584
TargetMu-type opioid receptor(Homo sapiens (Human))
Adolor
Curated by ChEMBL
LigandPNGBDBM50268584(Ac-D-pro-L-Phe-D-trp-L-Phe-NH2 | CHEMBL450818)
Affinity DataKi:  340nM. Assay description: Displacement of [3H]diprenorphine from human cloned mu receptor by cell based assay
In DepthDetails ArticlePubMed
TargetDelta-type opioid receptor(Homo sapiens (Human))
Adolor
Curated by ChEMBL
LigandPNGBDBM50268584(Ac-D-pro-L-Phe-D-trp-L-Phe-NH2 | CHEMBL450818)
Affinity DataKi: >1.00E+3nM. Assay description: Displacement of [3H]diprenorphine from human cloned delta receptor by cell based assay
In DepthDetails ArticlePubMed
TargetKappa-type opioid receptor(Homo sapiens (Human))
Adolor
Curated by ChEMBL
LigandPNGBDBM50268584(Ac-D-pro-L-Phe-D-trp-L-Phe-NH2 | CHEMBL450818)
Affinity DataKi: >1.00E+3nM. Assay description: Displacement of [3H]diprenorphine from human cloned kappa opioid receptor by cell based assay
In DepthDetails ArticlePubMed