BDBM50268937 1-(8-(2,6-dimethylbenzylamino)-2,3-dimethylimidazo[1,2-a]pyridin-6-yl)pyridin-4(1H)-one::CHEMBL495786
SMILES Cc1nc2c(NCc3c(C)cccc3C)cc(cn2c1C)-n1ccc(=O)cc1
InChI Key InChIKey=SUVHLBHXIPQGAC-UHFFFAOYSA-N
Data  3 IC50
  Tab Delimited (TSV)   2D SDfile   Computed 3D by Vconf -m prep SDfile
Find this compound or compounds like it in BindingDB:
Activity Spreadsheet -- Enzyme Inhibition Constant Data from BindingDB
Found 3 hits for monomerid = 50268937
TargetCytochrome P450 3A4(Homo sapiens (Human))
Glaxosmithkline
Curated by ChEMBL
LigandPNGBDBM50268937(1-(8-(2,6-dimethylbenzylamino)-2,3-dimethylimidazo...)
Affinity DataIC50:  1.60E+4nM. Assay description: Inhibition of CYP3A4 (unknown origin) using diethoxyfluorescein as substrate
In DepthDetails ArticlePubMed
TargetCytochrome P450 3A4(Homo sapiens (Human))
Glaxosmithkline
Curated by ChEMBL
LigandPNGBDBM50268937(1-(8-(2,6-dimethylbenzylamino)-2,3-dimethylimidazo...)
Affinity DataIC50:  2.80E+4nM. Assay description: Inhibition of CYP3A4 (unknown origin) using 7-benzyloxyquinoline as substrate
In DepthDetails ArticlePubMed
TargetCytochrome P450 2C9(Homo sapiens (Human))
Glaxosmithkline
Curated by ChEMBL
LigandPNGBDBM50268937(1-(8-(2,6-dimethylbenzylamino)-2,3-dimethylimidazo...)
Affinity DataIC50:  1.70E+4nM. Assay description: Inhibition of CYP2C9 (unknown origin)
In DepthDetails ArticlePubMed