BDBM50268961 2-Cyano-N-hexyl-3-[1-(3-dimethylaminopropyl)-2-methyl-1Hindol-3-yl]-acrylamide::CHEMBL496824
SMILES CCCCCCNC(=O)C(=C\c1c(C)n(CCCN(C)C)c2ccccc12)\C#N
InChI Key InChIKey=LVNGHMYJLPCBDR-LVZFUZTISA-N
Data  1 IC50
  Tab Delimited (TSV)   2D SDfile   Computed 3D by Vconf -m prep SDfile
Find this compound or compounds like it in BindingDB:
Activity Spreadsheet -- Enzyme Inhibition Constant Data from BindingDB
Found 1 hit for monomerid = 50268961
TargetDynamin-1(Homo sapiens (Human))
The University Of Newcastle
Curated by ChEMBL
LigandPNGBDBM50268961(2-Cyano-N-hexyl-3-[1-(3-dimethylaminopropyl)-2-met...)
Affinity DataIC50:  1.43E+4nM. Assay description: Inhibition of dynamin 1-mediated endocytosis internalization of Tf-A594 in human U2OS cells pretreated for 30 mins
In DepthDetails ArticlePubMed