BDBM50269071 CHEMBL4063351
SMILES OC(=O)C(CC(=O)C(S)Cc1ccc(Br)cc1)Cc1ccccc1
InChI Key InChIKey=AHQCOPKDZQVSSW-UHFFFAOYSA-N
Data  1 KI
  Tab Delimited (TSV)   2D SDfile   Computed 3D by Vconf -m prep SDfile
Find this compound or compounds like it in BindingDB:
Activity Spreadsheet -- Enzyme Inhibition Constant Data from BindingDB
Found 1 hit for monomerid = 50269071
TargetNeprilysin(Homo sapiens (Human))
Pharmaleads
Curated by ChEMBL
LigandPNGBDBM50269071(CHEMBL4063351)
Affinity DataKi:  1.75E+3nM. Assay description: Inhibition of recombinant human neprilysin using Suc-Ala-Ala-Phe-AMC as substrate preincubated for 30 mins followed by substrate addition measured af...
Ligand InfoKEGGPC cidPC sid
In DepthDetails ArticlePubMed