BDBM50269116 CHEMBL4076380
SMILES FC(F)(F)c1cccnc1-c1cccc(c1)C(=O)Nc1cccc(c1-c1cccnc1)C(F)(F)F
InChI Key InChIKey=BGEXEHUFMGIZSJ-UHFFFAOYSA-N
Data  4 IC50
  Tab Delimited (TSV)   2D SDfile   Computed 3D by Vconf -m prep SDfile
Find this compound or compounds like it in BindingDB:
Activity Spreadsheet -- Enzyme Inhibition Constant Data from BindingDB
Found 4 hits for monomerid = 50269116
TargetSodium channel protein type 5 subunit alpha(Homo sapiens (Human))
Amgen
Curated by ChEMBL
LigandPNGBDBM50269116(CHEMBL4076380)
Affinity DataIC50:  820nM. Assay description: Inhibition of human NaV1.5 expressed in HEK293 cells at -50 mV holding potential after 3 to 5 mins by PatchXpress automated electrophysiology method
In DepthDetails ArticlePubMed
TargetSodium channel protein type 9 subunit alpha(Rattus norvegicus)
Amgen
Curated by ChEMBL
LigandPNGBDBM50269116(CHEMBL4076380)
Affinity DataIC50:  5.60E+3nM. Assay description: Inhibition of rat NaV1.7 at -125 mV holding potential yielding 20 to 50% inactivation after 3 to 5 mins by PatchXpress automated electrophysiology me...
In DepthDetails ArticlePubMed
TargetSodium channel protein type 9 subunit alpha(Rattus norvegicus)
Amgen
Curated by ChEMBL
LigandPNGBDBM50269116(CHEMBL4076380)
Affinity DataIC50:  88nM. Assay description: Inhibition of slow inactivated rat NaV1.7 at -20 mV holding potential after 5 mins by IonWorks electrophysiology method
In DepthDetails ArticlePubMed
TargetSodium channel protein type 9 subunit alpha(Homo sapiens (Human))
Amgen
Curated by ChEMBL
LigandPNGBDBM50269116(CHEMBL4076380)
Affinity DataIC50:  66nM. Assay description: Inhibition of slow inactivated human NaV1.7 expressed in HEK293 cells at -20 mV holding potential after 5 mins by IonWorks electrophysiology method
In DepthDetails ArticlePubMed