BDBM50269118 CHEMBL4100413
SMILES FC(F)Oc1cccnc1-c1cccc(c1)C(=O)Nc1cccc(c1-c1cccnc1)C(F)(F)F
InChI Key InChIKey=DGULQSWQLJIZCW-UHFFFAOYSA-N
Data  1 KI  6 IC50
  Tab Delimited (TSV)   2D SDfile   Computed 3D by Vconf -m prep SDfile
Find this compound or compounds like it in BindingDB:
Activity Spreadsheet -- Enzyme Inhibition Constant Data from BindingDB
Found 7 hits for monomerid = 50269118
TargetPotassium voltage-gated channel subfamily H member 2(Homo sapiens (Human))
Amgen
Curated by ChEMBL
LigandPNGBDBM50269118(CHEMBL4100413)
Affinity DataKi: >3.00E+4nM. Assay description: Inhibition of human ERG
In DepthDetails ArticlePubMed
TargetSodium channel protein type 9 subunit alpha(Homo sapiens (Human))
Amgen
Curated by ChEMBL
LigandPNGBDBM50269118(CHEMBL4100413)
Affinity DataIC50:  11nM. Assay description: Inhibition of slow inactivated human NaV1.7 expressed in HEK293 cells at -20 mV holding potential after 5 mins by IonWorks electrophysiology method
In DepthDetails ArticlePubMed
TargetSodium channel protein type 9 subunit alpha(Mus musculus)
Amgen
Curated by ChEMBL
LigandPNGBDBM50269118(CHEMBL4100413)
Affinity DataIC50:  8nM. Assay description: Inhibition of slow inactivated mouse NaV1.7 expressed in HEK293 cells at -20 mV holding potential after 5 mins by IonWorks electrophysiology method
In DepthDetails ArticlePubMed
TargetSodium channel protein type 9 subunit alpha(Rattus norvegicus)
Amgen
Curated by ChEMBL
LigandPNGBDBM50269118(CHEMBL4100413)
Affinity DataIC50:  4.10E+3nM. Assay description: Inhibition of rat NaV1.7 at -125 mV holding potential yielding 20 to 50% inactivation after 3 to 5 mins by PatchXpress automated electrophysiology me...
In DepthDetails ArticlePubMed
TargetSodium channel protein type 9 subunit alpha(Homo sapiens (Human))
Amgen
Curated by ChEMBL
LigandPNGBDBM50269118(CHEMBL4100413)
Affinity DataIC50:  2.90E+3nM. Assay description: Inhibition of human NaV1.7 expressed in HEK293 cells at -125 mV holding potential yielding 20 to 50% inactivation after 3 to 5 mins by PatchXpress au...
In DepthDetails ArticlePubMed
TargetSodium channel protein type 5 subunit alpha(Homo sapiens (Human))
Amgen
Curated by ChEMBL
LigandPNGBDBM50269118(CHEMBL4100413)
Affinity DataIC50:  220nM. Assay description: Inhibition of human NaV1.5 expressed in HEK293 cells at -50 mV holding potential after 3 to 5 mins by PatchXpress automated electrophysiology method
In DepthDetails ArticlePubMed
TargetSodium channel protein type 9 subunit alpha(Rattus norvegicus)
Amgen
Curated by ChEMBL
LigandPNGBDBM50269118(CHEMBL4100413)
Affinity DataIC50:  43nM. Assay description: Inhibition of slow inactivated rat NaV1.7 at -20 mV holding potential after 5 mins by IonWorks electrophysiology method
In DepthDetails ArticlePubMed