BDBM50269604 CHEMBL447023::epiafzelechin-(4beta->8)-epicatechin
SMILES O[C@@H]1Cc2c(O)cc(O)c([C@@H]3[C@@H](O)[C@H](Oc4cc(O)cc(O)c34)c3ccc(O)c(O)c3)c2O[C@@H]1c1ccc(O)cc1
InChI Key InChIKey=MTCFYYIJIXJCPF-NFJBMHMQSA-N
Data  2 IC50
  Tab Delimited (TSV)   2D SDfile   Computed 3D by Vconf -m prep SDfile
Find this compound or compounds like it in BindingDB:
Activity Spreadsheet -- Enzyme Inhibition Constant Data from BindingDB
Found 2 hits for monomerid = 50269604
TargetProstaglandin G/H synthase 2(Homo sapiens (Human))
University Of Illinois At Chicago
Curated by ChEMBL
LigandPNGBDBM50269604(CHEMBL447023 | epiafzelechin-(4beta->8)-epicatechi...)
Affinity DataIC50: >1.00E+5nM. Assay description: Inhibition of COX2
In DepthDetails ArticlePubMed
TargetProstaglandin G/H synthase 1(Homo sapiens (Human))
University Of Illinois At Chicago
Curated by ChEMBL
LigandPNGBDBM50269604(CHEMBL447023 | epiafzelechin-(4beta->8)-epicatechi...)
Affinity DataIC50:  7.80E+4nM. Assay description: Inhibition of COX1
In DepthDetails ArticlePubMed