BDBM50270306 CHEMBL4077074
SMILES O=C(Nc1ccc(CN2CCOCC2)cc1)c1n[nH]cc1Nc1ncnc2sccc12
InChI Key InChIKey=WTKYHVUVQSLNBW-UHFFFAOYSA-N
Data  4 IC50
  Tab Delimited (TSV)   2D SDfile   Computed 3D by Vconf -m prep SDfile
Find this compound or compounds like it in BindingDB:
Activity Spreadsheet -- Enzyme Inhibition Constant Data from BindingDB
Found 4 hits for monomerid = 50270306
TargetCyclin-dependent kinase 6/G1/S-specific cyclin-D1(Homo sapiens (Human))
China Pharmaceutical University
Curated by ChEMBL
LigandPNGBDBM50270306(CHEMBL4077074)
Affinity DataIC50:  3.90nM. Assay description: Inhibition of human CDK6/Cyclin D1 using RB protein as substrate preincubated for 20 mins followed by [gamma-33P]-ATP addition measure after 120 mins...
In DepthDetails ArticlePubMed
TargetCyclin-A1/Cyclin-dependent kinase 2(Homo sapiens (Human))
China Pharmaceutical University
Curated by ChEMBL
LigandPNGBDBM50270306(CHEMBL4077074)
Affinity DataIC50:  3.40nM. Assay description: Inhibition of human CDK2/Cyclin A1 using histone H1 as substrate preincubated for 20 mins followed by [gamma-33P]-ATP addition measure after 120 mins...
In DepthDetails ArticlePubMed
TargetReceptor-type tyrosine-protein kinase FLT3(Homo sapiens (Human))
China Pharmaceutical University
Curated by ChEMBL
LigandPNGBDBM50270306(CHEMBL4077074)
Affinity DataIC50:  0.623nM. Assay description: Inhibition of human FLT3 using EAIYAAPFAKKK as substrate preincubated for 20 mins followed by [gamma-33P]-ATP addition measure after 120 mins by filt...
In DepthDetails ArticlePubMed
TargetCyclin-dependent kinase 4/G1/S-specific cyclin-D1(Homo sapiens (Human))
China Pharmaceutical University
Curated by ChEMBL
LigandPNGBDBM50270306(CHEMBL4077074)
Affinity DataIC50:  2.40nM. Assay description: Inhibition of human CDK4/Cyclin D1 using RB protein as substrate preincubated for 20 mins followed by [gamma-33P]-ATP addition measure after 120 mins...
In DepthDetails ArticlePubMed