BDBM50271301 CHEMBL4129566
SMILES CCC(=O)N[C@@H](Cc1ccc2ccccc2c1)C(=O)N[C@@H](CC(C)(C)C)C(=O)N[C@@H](CCCCN)C(=O)NC(c1ccccc1)c1ccccc1
InChI Key InChIKey=GZOFFDZTXJDMBP-KVBYWJEESA-N
Data  1 KI  1 IC50
  Tab Delimited (TSV)   2D SDfile   Computed 3D by Vconf -m prep SDfile
Find this compound or compounds like it in BindingDB:
Activity Spreadsheet -- Enzyme Inhibition Constant Data from BindingDB
Found 2 hits for monomerid = 50271301
TargetDCN1-like protein 1(Homo sapiens)
Zhejiang University
Curated by ChEMBL
LigandPNGBDBM50271301(CHEMBL4129566)
Affinity DataKi:  43nM. Assay description: Displacement of (S)-N1-((19S,22S)-26-Amino-19-carbamoyl-1-(3',6'-dihydroxy-3-oxo-3H-spiro[isobenzofuran-1,9'-xanthen]-5-yl)-1,13,21-trioxo-5,8,11-tri...
In DepthDetails ArticlePubMed
TargetDCN1-like protein 1(Homo sapiens)
Zhejiang University
Curated by ChEMBL
LigandPNGBDBM50271301(CHEMBL4129566)
Affinity DataIC50:  361nM. Assay description: Displacement of (S)-N1-((19S,22S)-26-Amino-19-carbamoyl-1-(3',6'-dihydroxy-3-oxo-3H-spiro[isobenzofuran-1,9'-xanthen]-5-yl)-1,13,21-trioxo-5,8,11-tri...
In DepthDetails ArticlePubMed