BDBM50271346 (3R,6R)-7-(2-Adamantan-1-yl-ethyl)-3-cyclohexyl-6-isobutyl-2,5,6,7-tetrahydro-3H-imidazo[1,2-a]imidazol-1-ium
SMILES CC(C)C[C@@H]1CN2[C@@H](C[NH+]=C2N1CCC12CC3CC(CC(C3)C1)C2)C1CCCCC1
InChI Key InChIKey=QNKXLYUZSLTESN-REPWKVNNSA-O
Data  1 IC50
  Tab Delimited (TSV)   2D SDfile   Computed 3D by Vconf -m prep SDfile
Find this compound or compounds like it in BindingDB:
Activity Spreadsheet -- Enzyme Inhibition Constant Data from BindingDB
Found 1 hit for monomerid = 50271346
TargetKappa-type opioid receptor(Cavia porcellus (domestic guinea pig))
Torrey Pines Institute For Molecular Studies
Curated by ChEMBL
LigandPNGBDBM50271346((3R,6R)-7-(2-Adamantan-1-yl-ethyl)-3-cyclohexyl-6-...)
Affinity DataIC50:  1.75E+3nM. Assay description: Displacement of [3H]U69593 from kappa opioid receptor in guinea pig brain homogenate
In DepthDetails ArticlePubMed