BDBM50271464 CHEMBL455310::N-(3-Aminomethyl-phenyl)-2-fluoro-acetamidine
SMILES NCc1cccc(NC(=N)CF)c1
InChI Key InChIKey=AIYKCDKFCIADCI-UHFFFAOYSA-N
Data  1 KI
  Tab Delimited (TSV)   2D SDfile   Computed 3D by Vconf -m prep SDfile
Find this compound or compounds like it in BindingDB:
Activity Spreadsheet -- Enzyme Inhibition Constant Data from BindingDB
Found 1 hit for monomerid = 50271464
TargetNitric oxide synthase, brain(Homo sapiens (Human))
Instituto De QuíMica MéDica
Curated by ChEMBL
LigandPNGBDBM50271464(CHEMBL455310 | N-(3-Aminomethyl-phenyl)-2-fluoro-a...)
Affinity DataKi:  11nM. Assay description: Inhibition of nNOS (unknown origin) assessed as conversion of L-[3H]arginine to L-[3H]citrulline
In DepthDetails ArticlePubMed