BDBM50271589 CHEMBL4128024
SMILES Cc1ccc2C(c3ccc(C)cc3CCc2c1)c1cn(Cc2cc(cc(c2)C(O)=O)C(O)=O)c(=O)[nH]c1=S
InChI Key InChIKey=QBELIWNCMLAFDT-UHFFFAOYSA-N
Data  1 KI  1 Kd
  Tab Delimited (TSV)   2D SDfile   Computed 3D by Vconf -m prep SDfile
Find this compound or compounds like it in BindingDB:
Activity Spreadsheet -- Enzyme Inhibition Constant Data from BindingDB
Found 2 hits for monomerid = 50271589
TargetP2Y purinoceptor 2(Homo sapiens (Human))
University Park Nottingham
Curated by ChEMBL
LigandPNGBDBM50271589(CHEMBL4128024)
Affinity DataKi:  145nM. Assay description: Displacement of (E)-2-((5-(7-Chloro-2-((3-((2-(6-(3-(5,5-difluoro-7,9-dimethyl-5H-5-lambda4,6-lambda4-dipyrrolo[1,2-c:2,1-f ][1,3,2]diazaborinin-3-yl...
In DepthDetails ArticlePubMed
TargetP2Y purinoceptor 2(Homo sapiens (Human))
University Park Nottingham
Curated by ChEMBL
LigandPNGBDBM50271589(CHEMBL4128024)
Affinity DataKd:  295nM. Assay description: Binding affinity to recombinant human N-terminal NLuc-tagged P2Y2R expressed in human 1321N1 cells incubated for 1 hr in presence of AR-C118925 by fu...
In DepthDetails ArticlePubMed