BDBM50271649 CHEMBL502771::N-Cyclopropyl-pyrazole-1-carboxamidine
SMILES N=C(NC1CC1)n1cccn1
InChI Key InChIKey=COEWCLLHEPYREI-UHFFFAOYSA-N
Data  1 KI
  Tab Delimited (TSV)   2D SDfile   Computed 3D by Vconf -m prep SDfile
Find this compound or compounds like it in BindingDB:
Activity Spreadsheet -- Enzyme Inhibition Constant Data from BindingDB
Found 1 hit for monomerid = 50271649
TargetNitric oxide synthase, brain(Homo sapiens (Human))
Instituto De QuíMica MéDica
Curated by ChEMBL
LigandPNGBDBM50271649(CHEMBL502771 | N-Cyclopropyl-pyrazole-1-carboxamid...)
Affinity DataKi:  5.00E+4nM. Assay description: Inhibition of nNOS (unknown origin) assessed as conversion of L-[3H]arginine to L-[3H]citrulline
In DepthDetails ArticlePubMed