BDBM50272103 CHEMBL499877::N-(9-Ethyl-9H-carbazol-3-yl)-3-(3-phenyl-1,2,4-oxadiazol-5-yl)propanamide
SMILES CCn1c2ccccc2c2cc(NC(=O)CCc3nc(no3)-c3ccccc3)ccc12
InChI Key InChIKey=GXYDSFUDSNMVRH-UHFFFAOYSA-N
Data  1 EC50
  Tab Delimited (TSV)   2D SDfile   Computed 3D by Vconf -m prep SDfile
Find this compound or compounds like it in BindingDB:
Activity Spreadsheet -- Enzyme Inhibition Constant Data from BindingDB
Found 1 hit for monomerid = 50272103
TargetCannabinoid receptor 2(Homo sapiens (Human))
Amgen
Curated by ChEMBL
LigandPNGBDBM50272103(CHEMBL499877 | N-(9-Ethyl-9H-carbazol-3-yl)-3-(3-p...)
Affinity DataEC50:  150nM. Assay description: Agonist activity at human recombinant CB2 receptor expressed in Sf9 cells by GTP-europium binding assay
In DepthDetails ArticlePubMed