BDBM50272166 CHEMBL4129119
SMILES CC(C)(CC(O)=O)C#Cc1ccc(cc1)C1Nc2c(N)ncnc2OC1(C)C
InChI Key InChIKey=IVMRYBRYNPGRCB-UHFFFAOYSA-N
Data  1 IC50
  Tab Delimited (TSV)   2D SDfile   Computed 3D by Vconf -m prep SDfile
Find this compound or compounds like it in BindingDB:
Activity Spreadsheet -- Enzyme Inhibition Constant Data from BindingDB
Found 1 hit for monomerid = 50272166
TargetDiacylglycerol O-acyltransferase 1(Homo sapiens (Human))
Wuxi Apptec (Shanghai)
Curated by ChEMBL
LigandPNGBDBM50272166(CHEMBL4129119)
Affinity DataIC50:  5.50E+3nM. Assay description: Inhibition of human DGAT1 expressed in insect cell membranes using diacylglycerol/[14C]-oleoyl-CoA as substrate preincubated for 10 mins followed by ...
In DepthDetails ArticlePubMed