BDBM50272263 1-[1-(4'-Fluoro-biphenyl-4-yl)-ethyl]-1H-imidazole::CHEMBL445171
SMILES CC(c1ccc(cc1)-c1ccc(F)cc1)n1ccnc1
InChI Key InChIKey=UPMQRSIZLKLPLH-UHFFFAOYSA-N
Data  1 IC50
  Tab Delimited (TSV)   2D SDfile   Computed 3D by Vconf -m prep SDfile
Find this compound or compounds like it in BindingDB:
Activity Spreadsheet -- Enzyme Inhibition Constant Data from BindingDB
Found 1 hit for monomerid = 50272263
TargetSteroid 17-alpha-hydroxylase/17,20 lyase(Homo sapiens (Human))
Saarland University
Curated by ChEMBL
LigandPNGBDBM50272263(1-[1-(4'-Fluoro-biphenyl-4-yl)-ethyl]-1H-imidazole...)
Affinity DataIC50:  1.10E+3nM. Assay description: Inhibition of human CYP17 expressed in Escherichia coli coexpressed with cytochrome P450 reductase
In DepthDetails ArticlePubMed