BDBM50272287 3-Methoxy-5-(6-methoxy-3-methyl-3,4-dihydronaphthalen-2-yl)pyridine::CHEMBL500145
SMILES COc1ccc2C=C(C(C)Cc2c1)c1cncc(OC)c1
InChI Key InChIKey=XAFWAVASAFRJHA-UHFFFAOYSA-N
Data  2 IC50
  Tab Delimited (TSV)   2D SDfile   Computed 3D by Vconf -m prep SDfile
Find this compound or compounds like it in BindingDB:
Activity Spreadsheet -- Enzyme Inhibition Constant Data from BindingDB
Found 2 hits for monomerid = 50272287
TargetCytochrome P450 11B1, mitochondrial(Homo sapiens (Human))
Saarland University
Curated by ChEMBL
LigandPNGBDBM50272287(3-Methoxy-5-(6-methoxy-3-methyl-3,4-dihydronaphtha...)
Affinity DataIC50:  100nM. Assay description: Inhibition of human CYP11B1 expressed in hamster V79 MZh cells
In DepthDetails ArticlePubMed
TargetCytochrome P450 11B2, mitochondrial(Homo sapiens (Human))
Saarland University
Curated by ChEMBL
LigandPNGBDBM50272287(3-Methoxy-5-(6-methoxy-3-methyl-3,4-dihydronaphtha...)
Affinity DataIC50:  1.20nM. Assay description: Inhibition of human CYP11B2 expressed in hamster V79 MZh cells
In DepthDetails ArticlePubMed