BDBM50272611 1-(4-aminophenylsulfonyl)-3-(2-mercaptoethyl)urea::4-AMINO-N-[(2-SULFANYLETHYL)CARBAMOYL]BENZENESULFONAMIDE::CHEMBL497689
SMILES Nc1ccc(cc1)S(=O)(=O)NC(=O)NCCS
InChI Key InChIKey=LHVDNDIAMJOEKH-UHFFFAOYSA-N
Data  1 IC50
PDB links: 1 PDB ID matches this monomer.
  Tab Delimited (TSV)   2D SDfile   Computed 3D by Vconf -m prep SDfile
Find this compound or compounds like it in BindingDB:
Activity Spreadsheet -- Enzyme Inhibition Constant Data from BindingDB
Found 1 hit for monomerid = 50272611
TargetFructose-1,6-bisphosphatase 1(Homo sapiens (Human))
F. Hoffmann-La Roche
Curated by ChEMBL
LigandPNGBDBM50272611(1-(4-aminophenylsulfonyl)-3-(2-mercaptoethyl)urea ...)
Affinity DataIC50:  1.60E+3nM. Assay description: Inhibition of human liver fructose-1,6-bisphosphatase