BDBM50272869 3-[(3-methylbenzene)sulfonyl]-1-[3-({[(3-methylbenzene)sulfonyl]carbamoyl}amino)propyl]urea::CHEMBL498538
SMILES Cc1cccc(c1)S(=O)(=O)NC(=O)NCCCNC(=O)NS(=O)(=O)c1cccc(C)c1
InChI Key InChIKey=VRVOXYZFKSPXFR-UHFFFAOYSA-N
Data  2 IC50
  Tab Delimited (TSV)   2D SDfile   Computed 3D by Vconf -m prep SDfile
Find this compound or compounds like it in BindingDB:
Activity Spreadsheet -- Enzyme Inhibition Constant Data from BindingDB
Found 2 hits for monomerid = 50272869
TargetFructose-1,6-bisphosphatase 1(Homo sapiens (Human))
F. Hoffmann-La Roche
Curated by ChEMBL
LigandPNGBDBM50272869(3-[(3-methylbenzene)sulfonyl]-1-[3-({[(3-methylben...)
Affinity DataIC50: >1.00E+5nM. Assay description: Inhibition of human liver fructose-1,6-bisphosphatase
In DepthDetails ArticlePubMed
TargetFructose-1,6-bisphosphatase 1(Homo sapiens (Human))
F. Hoffmann-La Roche
Curated by ChEMBL
LigandPNGBDBM50272869(3-[(3-methylbenzene)sulfonyl]-1-[3-({[(3-methylben...)
Affinity DataIC50:  3.85E+4nM. Assay description: Inhibition of human liver fructose-1,6-bisphosphatase in presence of fructose-2,6-bisphosphate
In DepthDetails ArticlePubMed