BDBM50273089 (+/-)-2-{5-[(4-Adamantan-1-yl-2-fluoro-benzoylamino)-methyl]-4-ethoxy-2-fluoro-benzyl}-butyric acid::CHEMBL457405
SMILES CCOc1cc(F)c(CC(CC)C(O)=O)cc1CNC(=O)c1ccc(cc1F)C12CC3CC(CC(C3)C1)C2
InChI Key InChIKey=PPXZIVISQNAYKI-UHFFFAOYSA-N
Data  3 EC50
  Tab Delimited (TSV)   2D SDfile   Computed 3D by Vconf -m prep SDfile
Find this compound or compounds like it in BindingDB:
Activity Spreadsheet -- Enzyme Inhibition Constant Data from BindingDB
Found 3 hits for monomerid = 50273089
TargetPeroxisome proliferator-activated receptor alpha(Homo sapiens (Human))
The University Of Tokyo
Curated by ChEMBL
LigandPNGBDBM50273089((+/-)-2-{5-[(4-Adamantan-1-yl-2-fluoro-benzoylamin...)
Affinity DataEC50:  7.5nM. Assay description: Agonist activity at PPARalpha (unknown origin) transfected in HEK293 cells by GAL4 transactivation assay
In DepthDetails ArticlePubMed
TargetPeroxisome proliferator-activated receptor gamma(Homo sapiens (Human))
The University Of Tokyo
Curated by ChEMBL
LigandPNGBDBM50273089((+/-)-2-{5-[(4-Adamantan-1-yl-2-fluoro-benzoylamin...)
Affinity DataEC50:  22nM. Assay description: Agonist activity at PPARgamma (unknown origin) transfected in HEK293 cells by GAL4 transactivation assay
In DepthDetails ArticlePubMed
TargetPeroxisome proliferator-activated receptor delta(Homo sapiens (Human))
The University Of Tokyo
Curated by ChEMBL
LigandPNGBDBM50273089((+/-)-2-{5-[(4-Adamantan-1-yl-2-fluoro-benzoylamin...)
Affinity DataEC50:  55nM. Assay description: Agonist activity at PPARdelta (unknown origin) transfected in HEK293 cells by GAL4 transactivation assay
In DepthDetails ArticlePubMed