BDBM50273451 4-{2-[(S)-1-(4-Fluorophenyl)ethylamino]-5-methyl-4-oxo-4,5-dihydrothiazol-5-yl}-N-methylbenzamide::CHEMBL455895
SMILES CNC(=O)c1ccc(cc1)C1(C)SC(N[C@@H](C)c2ccc(F)cc2)=NC1=O
InChI Key InChIKey=HLKILUBKCZMAKT-SVZXGPMESA-N
Data  1 KI
  Tab Delimited (TSV)   2D SDfile   Computed 3D by Vconf -m prep SDfile
Find this compound or compounds like it in BindingDB:
Activity Spreadsheet -- Enzyme Inhibition Constant Data from BindingDB
Found 1 hit for monomerid = 50273451
Target11-beta-hydroxysteroid dehydrogenase 1(Homo sapiens (Human))
Amgen
Curated by ChEMBL
LigandPNGBDBM50273451(4-{2-[(S)-1-(4-Fluorophenyl)ethylamino]-5-methyl-4...)
Affinity DataKi:  76nM. Assay description: Inhibition of human recombinant 11beta-HSD1 expressed in Escherichia coli using [3H]cortisone by scintillation proximity assay
In DepthDetails ArticlePubMed