BDBM50274140 1-methyl-2-(((1R,5S)-6-((4-(trifluoromethyl)phenoxy)methyl)-3-aza-bicyclo[3.1.0]hexan-3-yl)methyl)-1H-imidazo[4,5-c]pyridine::CHEMBL519817
SMILES Cn1c(CN2C[C@H]3C(COc4ccc(cc4)C(F)(F)F)[C@H]3C2)nc2cnccc12
InChI Key InChIKey=VATWUHJOCAJJQN-SJPCQFCGSA-N
Data  1 EC50
  Tab Delimited (TSV)   2D SDfile   Computed 3D by Vconf -m prep SDfile
Find this compound or compounds like it in BindingDB:
Activity Spreadsheet -- Enzyme Inhibition Constant Data from BindingDB
Found 1 hit for monomerid = 50274140
TargetMetabotropic glutamate receptor 2(Homo sapiens (Human))
Pfizer
Curated by ChEMBL
LigandPNGBDBM50274140(1-methyl-2-(((1R,5S)-6-((4-(trifluoromethyl)phenox...)
Affinity DataEC50:  251nM. Assay description: Activity at rat mGluR2 receptor expressed in HEK cells by FLIPR assay in presence of glutamate
In DepthDetails ArticlePubMed