BDBM50274220 5-amino-3-(1-cyano-2-(5-(2-nitrophenyl)furan-2-yl)vinyl)-1-phenyl-1H-pyrazole-4-carbonitrile::CHEMBL484749
SMILES Nc1c(C#N)c(nn1-c1ccccc1)C(=C\c1ccc(o1)-c1ccccc1[N+]([O-])=O)\C#N
InChI Key InChIKey=ROMNURDJRFJDRK-NTCAYCPXSA-N
Data  1 IC50
  Tab Delimited (TSV)   2D SDfile   Computed 3D by Vconf -m prep SDfile
Find this compound or compounds like it in BindingDB:
Activity Spreadsheet -- Enzyme Inhibition Constant Data from BindingDB
Found 1 hit for monomerid = 50274220
TargetATP-dependent RNA helicase DDX3X(Homo sapiens (Human))
Istituto Di Genetica Molecolare
Curated by ChEMBL
LigandPNGBDBM50274220(5-amino-3-(1-cyano-2-(5-(2-nitrophenyl)furan-2-yl)...)
Affinity DataIC50:  3.00E+5nM. Assay description: Inhibition of ATPase activity in human recombinant DDX3 expressed in Escherichia coli by luciferase-based luminescence assay in presence of ATP
In DepthDetails ArticlePubMed