BDBM50274258 2-(6,8-Dichloro-2-(4-methoxyphenyl)imidazo[1,2-a]pyridin-3-yl)-N,N-dipropylacetamide::CHEMBL509917
SMILES CCCN(CCC)C(=O)Cc1c(nc2c(Cl)cc(Cl)cn12)-c1ccc(OC)cc1
InChI Key InChIKey=UHHAJQVIKPJWKL-UHFFFAOYSA-N
Data  3 KI  1 EC50
  Tab Delimited (TSV)   2D SDfile   Computed 3D by Vconf -m prep SDfile
Find this compound or compounds like it in BindingDB:
Activity Spreadsheet -- Enzyme Inhibition Constant Data from BindingDB
Found 4 hits for monomerid = 50274258
TargetTranslocator protein(Rattus norvegicus (rat))
Universita Degli Studi Di Bari
Curated by ChEMBL
LigandPNGBDBM50274258(2-(6,8-Dichloro-2-(4-methoxyphenyl)imidazo[1,2-a]p...)
Affinity DataKi:  0.310nM. Assay description: Displacement of [3H]PK11195 from peripheral benzodiazepine receptor in Sprague-Dawley rat cerebral cortex membrane by liquid scintillation counting
In DepthDetails ArticlePubMed
TargetTranslocator protein(Homo sapiens (Human))
Palack£
Curated by ChEMBL
LigandPNGBDBM50274258(2-(6,8-Dichloro-2-(4-methoxyphenyl)imidazo[1,2-a]p...)
Affinity DataKi:  0.537nM. Assay description: Inhibition of TSPO (unknown origin)
In DepthDetails ArticlePubMed
TargetTranslocator protein(Homo sapiens (Human))
Palack£
Curated by ChEMBL
LigandPNGBDBM50274258(2-(6,8-Dichloro-2-(4-methoxyphenyl)imidazo[1,2-a]p...)
Affinity DataKi:  0.537nM. Assay description: Inhibition of TSPO (unknown origin)
In DepthDetails ArticlePubMed
TargetTranslocator protein(Homo sapiens (Human))
Palack£
Curated by ChEMBL
LigandPNGBDBM50274258(2-(6,8-Dichloro-2-(4-methoxyphenyl)imidazo[1,2-a]p...)
Affinity DataEC50:  571nM. Assay description: Inhibition of TSPO (unknown origin) in mouse MA-10 cells assessed as increase in steroid steroidogenesis
In DepthDetails PubMed