BDBM50274457 CHEMBL526352::FGGFTGARKSARKAANQ
SMILES [#6]-[#6@@H](-[#8])-[#6@H](-[#7]-[#6](=O)-[#6@H](-[#6]-c1ccccc1)-[#7]-[#6](=O)-[#6]-[#7]-[#6](=O)-[#6]-[#7]-[#6](=O)-[#6@@H](-[#7])-[#6]-c1ccccc1)-[#6](=O)-[#7]-[#6]-[#6](=O)-[#7]-[#6@@H](-[#6])-[#6](=O)-[#7]-[#6@@H](-[#6]-[#6]-[#6]\[#7]=[#6](/[#7])-[#7])-[#6](=O)-[#7]-[#6@@H](-[#6]-[#6]-[#6]-[#6]-[#7])-[#6](=O)-[#7]-[#6@@H](-[#6]-[#8])-[#6](=O)-[#7]-[#6@@H](-[#6])-[#6](=O)-[#7]-[#6@@H](-[#6]-[#6]-[#6]\[#7]=[#6](/[#7])-[#7])-[#6](=O)-[#7]-[#6@@H](-[#6]-[#6]-[#6]-[#6]-[#7])-[#6](=O)-[#7]-[#6@@H](-[#6])-[#6](=O)-[#7]-[#6@@H](-[#6])-[#6](=O)-[#7]-[#6@@H](-[#6]-[#6](-[#7])=O)-[#6](=O)-[#7]-[#6@@H](-[#6]-[#6]-[#6](-[#7])=O)-[#6](-[#8])=O
InChI Key InChIKey=FMVUBOOWCUPBBL-OVWUADNCSA-N
Data  1 IC50  1 EC50
  Tab Delimited (TSV)   2D SDfile   Computed 3D by Vconf -m prep SDfile
Find this compound or compounds like it in BindingDB:
Activity Spreadsheet -- Enzyme Inhibition Constant Data from BindingDB
Found 2 hits for monomerid = 50274457
TargetNociceptin receptor(RAT)
TBA
Curated by ChEMBL
LigandPNGBDBM50274457(CHEMBL526352 | FGGFTGARKSARKAANQ)
Affinity DataEC50:  11nM. Assay description: Activation of rat ORL1 receptor expressed in african green monkey COS7 cells by [35S]GTPgammaS binding assay
In DepthDetails ArticlePubMed
TargetNociceptin receptor(RAT)
TBA
Curated by ChEMBL
LigandPNGBDBM50274457(CHEMBL526352 | FGGFTGARKSARKAANQ)
Affinity DataIC50:  1.5nM. Assay description: Displacement of [3H]nociceptin from rat ORL1 receptor expressed in african green monkey COS7 cells
In DepthDetails ArticlePubMed