BDBM50274538 CHEMBL4126773
SMILES COc1cc(cnc1OC)-c1ccc2C(=O)N([C@H](C)c2n1)c1cnn(CC(F)(F)F)c1
InChI Key InChIKey=DREWJJJKWOJZQM-LLVKDONJSA-N
Data  2 KI  5 IC50
  Tab Delimited (TSV)   2D SDfile   Computed 3D by Vconf -m prep SDfile
Find this compound or compounds like it in BindingDB:
Activity Spreadsheet -- Enzyme Inhibition Constant Data from BindingDB
Found 7 hits for monomerid = 50274538
TargetPhosphatidylinositol 4,5-bisphosphate 3-kinase catalytic subunit gamma isoform(Homo sapiens (Human))
Vertex Pharmaceuticals
Curated by ChEMBL
LigandPNGBDBM50274538(CHEMBL4126773)
Affinity DataKi:  4nM. Assay description: Inhibition of PI3Kgamma (unknown origin) using PIP2 as substrate after 15 mins in presence of [33P-ATP] by liquid scintillation counting method
In DepthDetails ArticlePubMed
TargetDNA-dependent protein kinase catalytic subunit(Homo sapiens (Human))
Vertex Pharmaceuticals
Curated by ChEMBL
LigandPNGBDBM50274538(CHEMBL4126773)
Affinity DataKi:  260nM. Assay description: Inhibition of DNA-PK (unknown origin) using EPPLSQEAFADLWKKK as substrate after 15 mins in presence of [33P-ATP] by radiometric method
In DepthDetails ArticlePubMed
TargetPhosphatidylinositol 4,5-bisphosphate 3-kinase catalytic subunit gamma isoform(Homo sapiens (Human))
Vertex Pharmaceuticals
Curated by ChEMBL
LigandPNGBDBM50274538(CHEMBL4126773)
Affinity DataIC50:  170nM. Assay description: Inhibition of PI3Kgamma in human THP1 cells assessed as inhibition of MCP1-induced Akt phosphorylation at Ser-47 residue preincubated for 1 hr follow...
In DepthDetails ArticlePubMed
TargetPhosphatidylinositol 4,5-bisphosphate 3-kinase catalytic subunit gamma isoform(Homo sapiens (Human))
Vertex Pharmaceuticals
Curated by ChEMBL
LigandPNGBDBM50274538(CHEMBL4126773)
Affinity DataIC50:  140nM. Assay description: Inhibition of PI3Kgamma in TNFalpha primed human neutrophils assessed as inhibition of fMLP-induced ROS generation preincubated for 30 to 60 mins fol...
In DepthDetails ArticlePubMed
TargetPhosphatidylinositol 4,5-bisphosphate 3-kinase catalytic subunit gamma isoform(Homo sapiens (Human))
Vertex Pharmaceuticals
Curated by ChEMBL
LigandPNGBDBM50274538(CHEMBL4126773)
Affinity DataIC50:  500nM. Assay description: Inhibition of PI3Kgamma in TNFalpha primed human whole blood assessed as inhibition of fMLP-induced ROS generation preincubated for 30 to 60 mins fol...
In DepthDetails ArticlePubMed
TargetPotassium voltage-gated channel subfamily H member 2(Homo sapiens (Human))
Vertex Pharmaceuticals
Curated by ChEMBL
LigandPNGBDBM50274538(CHEMBL4126773)
Affinity DataIC50: >3.00E+4nM. Assay description: Inhibition of human ERG
In DepthDetails ArticlePubMed
TargetPhosphatidylinositol-4,5-bisphosphate 3-kinase(Rattus norvegicus)
Vertex Pharmaceuticals
Curated by ChEMBL
LigandPNGBDBM50274538(CHEMBL4126773)
Affinity DataIC50:  210nM. Assay description: Inhibition of PI3Kgamma in rat spleenocytes assessed as inhibition of MCP1-induced Akt phosphorylation at Ser-47 residue preincubated for 1 hr follow...
In DepthDetails ArticlePubMed