BDBM50274584 CHEMBL4125719
SMILES N#CC(=Cc1ccc(o1)-c1nc2cnc3[nH]ccc3c2n1C1CCCCC1)C#N
InChI Key InChIKey=GBYCPXROHVGSKM-UHFFFAOYSA-N
Data  5 IC50  4 EC50
  Tab Delimited (TSV)   2D SDfile   Computed 3D by Vconf -m prep SDfile
Find this compound or compounds like it in BindingDB:
Activity Spreadsheet -- Enzyme Inhibition Constant Data from BindingDB
Found 9 hits for monomerid = 50274584
TargetTyrosine-protein kinase JAK3(Homo sapiens (Human))
Eberhard Karls University T£Bingen
Curated by ChEMBL
LigandPNGBDBM50274584(CHEMBL4125719)
Affinity DataEC50:  678nM. Assay description: Inhibition of kinase tracer-05 binding to C-terminal NanoLuc tagged full length JAK3 (unknown origin) expressed in HEK cells by NanoBRET assay
In DepthDetails ArticlePubMed
TargetTyrosine-protein kinase JAK1(Homo sapiens (Human))
Eberhard Karls University T£Bingen
Curated by ChEMBL
LigandPNGBDBM50274584(CHEMBL4125719)
Affinity DataIC50:  4nM. Assay description: Inhibition of human JAK1 using poly[Glu:Tyr] (4:1) as substrate in presence of 10 uM [gamma33P]ATP by radiometric method
In DepthDetails ArticlePubMed
TargetTyrosine-protein kinase JAK2(Homo sapiens (Human))
Eberhard Karls University T£Bingen
Curated by ChEMBL
LigandPNGBDBM50274584(CHEMBL4125719)
Affinity DataIC50:  188nM. Assay description: Inhibition of human JAK2 using poly[Glu:Tyr] (4:1) as substrate in presence of 10 uM [gamma33P]ATP by radiometric method
In DepthDetails ArticlePubMed
TargetTyrosine-protein kinase JAK3(Homo sapiens (Human))
Eberhard Karls University T£Bingen
Curated by ChEMBL
LigandPNGBDBM50274584(CHEMBL4125719)
Affinity DataIC50:  4nM. Assay description: Inhibition of recombinant human JAK3 (781 to 1124 residues) expressed in baculovirus expression system assessed as reduction in polypeptide substrate...
In DepthDetails ArticlePubMed
TargetTyrosine-protein kinase BTK(Homo sapiens (Human))
Eberhard Karls University T£Bingen
Curated by ChEMBL
LigandPNGBDBM50274584(CHEMBL4125719)
Affinity DataEC50:  5.79E+3nM. Assay description: Inhibition of kinase tracer-05 binding to C-terminal NanoLuc tagged full length BTK (unknown origin) expressed in HEK cells by NanoBRET assay
In DepthDetails ArticlePubMed
TargetNon-receptor tyrosine-protein kinase TYK2(Homo sapiens (Human))
Eberhard Karls University T£Bingen
Curated by ChEMBL
LigandPNGBDBM50274584(CHEMBL4125719)
Affinity DataIC50:  14nM. Assay description: Inhibition of human TYK2 using KKSRGDYMTMQIG as substrate in presence of 10 uM [gamma33P]ATP by radiometric method
In DepthDetails ArticlePubMed
TargetTyrosine-protein kinase JAK1(Homo sapiens (Human))
Eberhard Karls University T£Bingen
Curated by ChEMBL
LigandPNGBDBM50274584(CHEMBL4125719)
Affinity DataEC50:  7.66E+3nM. Assay description: Inhibition of kinase tracer-04 binding to C-terminal NanoLuc tagged full length JAK1 (unknown origin) expressed in HEK cells by NanoBRET assay
In DepthDetails ArticlePubMed
TargetTyrosine-protein kinase JAK2(Homo sapiens (Human))
Eberhard Karls University T£Bingen
Curated by ChEMBL
LigandPNGBDBM50274584(CHEMBL4125719)
Affinity DataEC50:  630nM. Assay description: Inhibition of kinase tracer-05 binding to C-terminal NanoLuc tagged full length JAK2 (unknown origin) expressed in HEK cells by NanoBRET assay
In DepthDetails ArticlePubMed
TargetTyrosine-protein kinase JAK3(Homo sapiens (Human))
Eberhard Karls University T£Bingen
Curated by ChEMBL
LigandPNGBDBM50274584(CHEMBL4125719)
Affinity DataIC50:  0.390nM. Assay description: Inhibition of human JAK3 using GEEEEYFELVKKKK as substrate in presence of 10 uM [gamma33P]ATP by radiometric method
In DepthDetails ArticlePubMed