BDBM50274760 3-O-DECYL-2-DEOXY-6-O-{2-DEOXY-3-O-[(3R)-3-METHOXYDECYL]-6-O-METHYL-2-[(11Z)-OCTADEC-11-ENOYLAMINO]-4-O-PHOSPHONO-BETA-D-GLUCOPYRANOSYL}-2-[(3-OXOTETRADECANOYL)AMINO]-1-O-PHOSPHONO-ALPHA-D-GLUCOPYRANOSE::CHEMBL501259::E5564
SMILES CCCCCCCCCCCC(=O)CC(=O)N[C@H]1[C@@H](OP(O)(O)=O)O[C@H](CO[C@@H]2O[C@H](COC)[C@@H](OP(O)(O)=O)[C@H](OCC[C@@H](CCCCCCC)OC)[C@H]2NC(=O)CCCCCCCCC\C=C/CCCCCC)[C@@H](O)[C@@H]1OCCCCCCCCCC
InChI Key InChIKey=BPSMYQFMCXXNPC-MFCPCZTFSA-N
Data  3 IC50
PDB links: 2 PDB IDs match this monomer.
  Tab Delimited (TSV)   2D SDfile   Computed 3D by Vconf -m prep SDfile
Find this compound or compounds like it in BindingDB:
Activity Spreadsheet -- Enzyme Inhibition Constant Data from BindingDB
Found 3 hits for monomerid = 50274760
TargetToll-like receptor 4(Homo sapiens (Human))
Schering-Plough Research Institute
Curated by ChEMBL
LigandPNGBDBM50274760(3-O-DECYL-2-DEOXY-6-O-{2-DEOXY-3-O-[(3R)-3-METHOXY...)
Affinity DataIC50:  1.5nM. Assay description: Antagonist activity at human TLR4 expressed in HE293 cells by ELAM1-luciferase reporter gene assay
TargetToll-like receptor 4(Homo sapiens (Human))
Schering-Plough Research Institute
Curated by ChEMBL
LigandPNGBDBM50274760(3-O-DECYL-2-DEOXY-6-O-{2-DEOXY-3-O-[(3R)-3-METHOXY...)
Affinity DataIC50:  1.5nM. Assay description: Antagonist activity at TLR4 in human serum assessed as reduction in LPS-induced TNFalpha production after 3 hrs by ELISA
TargetToll-like receptor 4(Homo sapiens (Human))
Schering-Plough Research Institute
Curated by ChEMBL
LigandPNGBDBM50274760(3-O-DECYL-2-DEOXY-6-O-{2-DEOXY-3-O-[(3R)-3-METHOXY...)
Affinity DataIC50:  1.5nM. Assay description: Antagonist activity at TLR4 in human HL60 cells assessed as inhibition of LPS-induced cytokine production