BDBM50274781 3-(5-(2-methoxybenzylidene)-4-oxo-2-thioxothiazolidin-3-yl)-N-(3-hydroxyphenyl)propanamide::CHEMBL514760
SMILES COc1ccccc1\C=C1/SC(=S)N(CCC(=O)Nc2cccc(O)c2)C1=O
InChI Key InChIKey=GWSKKPNVTXFJFH-BOPFTXTBSA-N
Data  1 IC50
  Tab Delimited (TSV)   2D SDfile   Computed 3D by Vconf -m prep SDfile
Find this compound or compounds like it in BindingDB:
Activity Spreadsheet -- Enzyme Inhibition Constant Data from BindingDB
Found 1 hit for monomerid = 50274781
TargetATP-dependent RNA helicase DDX3X(Homo sapiens (Human))
Istituto Di Genetica Molecolare
Curated by ChEMBL
LigandPNGBDBM50274781(3-(5-(2-methoxybenzylidene)-4-oxo-2-thioxothiazoli...)
Affinity DataIC50:  2.00E+5nM. Assay description: Inhibition of ATPase activity in human recombinant DDX3 expressed in Escherichia coli by luciferase-based luminescence assay in presence of ATP
In DepthDetails ArticlePubMed