BDBM50274852 2-(methylamino)-2-oxoethyl 4-(4-chlorophenethyl)piperidine-1-carboxylate::CHEMBL457918
SMILES CNC(=O)COC(=O)N1CCC(CCc2ccc(Cl)cc2)CC1
InChI Key InChIKey=JFSSVCSHPDLFCM-UHFFFAOYSA-N
Data  1 IC50
  Tab Delimited (TSV)   2D SDfile   Computed 3D by Vconf -m prep SDfile
Find this compound or compounds like it in BindingDB:
Activity Spreadsheet -- Enzyme Inhibition Constant Data from BindingDB
Found 1 hit for monomerid = 50274852
TargetFatty-acid amide hydrolase 1(Homo sapiens (Human))
Johnson & Johnson Pharmaceutical Research And Development
Curated by ChEMBL
LigandPNGBDBM50274852(2-(methylamino)-2-oxoethyl 4-(4-chlorophenethyl)pi...)
Affinity DataIC50:  13nM. Assay description: Inhibition of FAAH
In DepthDetails ArticlePubMed