BDBM50274887 (Z)-5-(3',4'-Dichlorobenzylidene)-2-thioxothiazolidin-4-one::CHEMBL506606
SMILES SC1=NC(=O)C(S1)=Cc1ccc(Cl)c(Cl)c1
InChI Key InChIKey=ZLJFJFLVZUHVOW-UHFFFAOYSA-N
Data  1 IC50
  Tab Delimited (TSV)   2D SDfile   Computed 3D by Vconf -m prep SDfile
Find this compound or compounds like it in BindingDB:
Activity Spreadsheet -- Enzyme Inhibition Constant Data from BindingDB
Found 1 hit for monomerid = 50274887
TargetArylamine N-acetyltransferase 1(Homo sapiens (Human))
University Of Oxford
Curated by ChEMBL
LigandPNGBDBM50274887((Z)-5-(3',4'-Dichlorobenzylidene)-2-thioxothiazoli...)
Affinity DataIC50:  3.40E+3nM. Assay description: Inhibition of human recombinant NAT1 assessed as hydrolysis of acetyl coA using PABA as substrate by Ellman's method
In DepthDetails ArticlePubMed