BDBM50275055 4-{4-[2-(Phenyl-2-pyridinylamino)ethoxy]phenyl}butyric Acid::CHEMBL463785
SMILES OC(=O)CCCc1ccc(OCCN(c2ccccc2)c2ccccn2)cc1
InChI Key InChIKey=WQXHZCYCKCQFQP-UHFFFAOYSA-N
Data  4 EC50
  Tab Delimited (TSV)   2D SDfile   Computed 3D by Vconf -m prep SDfile
Find this compound or compounds like it in BindingDB:
Activity Spreadsheet -- Enzyme Inhibition Constant Data from BindingDB
Found 4 hits for monomerid = 50275055
TargetFree fatty acid receptor 4(Homo sapiens (Human))
Nagoya City University
Curated by ChEMBL
LigandPNGBDBM50275055(4-{4-[2-(Phenyl-2-pyridinylamino)ethoxy]phenyl}but...)
Affinity DataEC50:  1.20E+3nM. Assay description: Agonist activity at human GPR120-Galpha16 fusion protein expressed in Flp-in HEK293 cells assessed as effect on intracellular calcium concentration b...
In DepthDetails ArticlePubMed
TargetFree fatty acid receptor 4(Homo sapiens (Human))
Nagoya City University
Curated by ChEMBL
LigandPNGBDBM50275055(4-{4-[2-(Phenyl-2-pyridinylamino)ethoxy]phenyl}but...)
Affinity DataEC50:  2.40E+3nM. Assay description: Agonist activity at GPR120 expressed in HEK 293 cells assessed as beta-arrestin recruitment after 5 mins by BRET assay
In DepthDetails ArticlePubMed
TargetFree fatty acid receptor 1(Homo sapiens (Human))
University Of Southern Denmark
Curated by ChEMBL
LigandPNGBDBM50275055(4-{4-[2-(Phenyl-2-pyridinylamino)ethoxy]phenyl}but...)
Affinity DataEC50:  9.77E+3nM. Assay description: Agonist activity at FFAR1 expressed in HEK 293 cells assessed as beta-arrestin recruitment after 30 mins by BRET assay
In DepthDetails ArticlePubMed
TargetFree fatty acid receptor 1(Homo sapiens (Human))
University Of Southern Denmark
Curated by ChEMBL
LigandPNGBDBM50275055(4-{4-[2-(Phenyl-2-pyridinylamino)ethoxy]phenyl}but...)
Affinity DataEC50:  1.90E+4nM. Assay description: Agonist activity at human GPR40 expressed in T-REx HEK293 cells assessed as effect on intracellular calcium concentration by FLIPR assay
In DepthDetails ArticlePubMed