BDBM50275234 (S)-N-(1,2,3,4-tetrahydronaphthalen-1-yl)-1H-benzo[d]imidazol-2-amine::CHEMBL486156
SMILES C1C[C@H](Nc2nc3ccccc3[nH]2)c2ccccc2C1
InChI Key InChIKey=XZIZUQSOFMLIIR-AWEZNQCLSA-N
Data  1 Kd
  Tab Delimited (TSV)   2D SDfile   Computed 3D by Vconf -m prep SDfile
Find this compound or compounds like it in BindingDB:
Activity Spreadsheet -- Enzyme Inhibition Constant Data from BindingDB
Found 1 hit for monomerid = 50275234
TargetSmall conductance calcium-activated potassium channel protein 3(Rattus norvegicus)
Neurosearch
Curated by ChEMBL
LigandPNGBDBM50275234((S)-N-(1,2,3,4-tetrahydronaphthalen-1-yl)-1H-benzo...)
Affinity DataKd:  450nM. Assay description: Inhibition of Wistar rat recombinant SK3 channel expressed in HEK293 cells by whole cell patch clamp technique
In DepthDetails ArticlePubMed